{"text_format":"1","workbook":"xlsx","n_sheets":16,"sheets":["Oficio Conductor","Inicio","Carta Gantt","Resumen","1.- Trabajos de Auditoría","2.- Trabajos de Consultoría","3.- Trabajos de Seguimiento","4.- Trabajos Rutinarios","5.- Trabajos Dirección","Calculo de horas disponibles","Detalle Capacitaciones","6.- Resumen de horas estimadas","formato_resumen","Plan - COSO","Instituciones","datos"],"not_rendered":{"charts":0,"images":1,"macros":1,"external_links":0,"defined_names":102,"comments":7,"pivot_tables":0},"unopened":[],"bounds":{"document_bytes":16777216,"sheet_cells":100000,"rows_first":2000,"rows_last":500,"rows_between":2000,"halvings":0,"cell_chars":16384,"cell_head_chars":4096},"cells_cut":0,"cells_raw":0,"read":"whole","date_system":"1900"}

{"sheet":"Oficio Conductor","index":0,"n_rows":0,"n_cols":0,"rows_kept":0,"cut":false,"hidden":false,"merged":[]}

{"sheet":"Inicio","index":1,"n_rows":23,"n_cols":7,"rows_kept":23,"cut":false,"hidden":false,"merged":[[13,1,13,4],[2,1,2,4]]}
[1]
[]
[null,"Plan Anual de Auditoría"]
[null,"Ministerio","OBRAS PÚBLICAS","Año planificado",2022,null,"  "]
[null,"Servicio","DIRECCIÓN DE ARQUITECTURA","Versión enviada a CAIGG","01"]
[null,"Servicio dependiente",null,"Fecha de Emisión:","2021-12-23"]
{"$rows_left_out":18}
{"sheet":"Carta Gantt","index":2,"n_rows":37,"n_cols":15,"rows_kept":37,"cut":false,"hidden":false,"merged":[[3,3,3,14],[1,1,1,14],[3,1,4,1],[3,2,4,2]]}
[]
[null,"Carta Gantt"]
[]
[null,"Código Trabajo","Nombre Trabajo ","CARTA GANTT"]
[null,null,null,"E","F","M","A","M","J","J","A","S","O","N","D"]
[null,"ASEG-1","Ejecución de Obras",null,null,"X","X","X","X"]
{"$rows_left_out":32}
{"sheet":"Resumen","index":3,"n_rows":82,"n_cols":17,"rows_kept":82,"cut":false,"hidden":false,"merged":[[46,1,46,12],[1,1,1,12],[3,2,3,5],[3,7,3,10],[4,2,4,5],[4,7,4,10],[5,2,5,5],[5,7,5,10],[6,2,6,5],[6,7,6,10],[8,1,8,16],[25,1,25,14],[31,1,31,16],[81,6,81,9],[68,1,68,16],[74,1,74,11],[75,1,75,2],[75,3,75,11],[76,1,76,2],[76,3,76,11],[77,1,77,2],[77,3,77,11],[78,1,78,2],[78,3,78,11],[80,6,80,9]]}
[]
[null,"Plan Anual de Auditoría "]
[]
[null,"Ministerio: ","OBRAS PÚBLICAS",null,null,null,"Año planificado",2022]
[null,"Servicio:","DIRECCIÓN DE ARQUITECTURA",null,null,null,"Versión",1]
[null,"Servicio dependiente",null,null,null,null,"Fecha de Emisión:","23-12-2021"]
{"$rows_left_out":77}
{"sheet":"1.- Trabajos de Auditoría","index":4,"n_rows":200,"n_cols":16,"rows_kept":200,"cut":false,"hidden":false,"merged":[[1,0,1,11]]}
[1]
["1.- Trabajos de Auditoría Priorizados en Base a Análisis de Riesgos"]
[]
["Código del Trabajo de Auditoria ","Nombre del Trabajo","Tipo de Trabajo","Objetivo de Auditoría General del Trabajo","Proceso Transversal en el Estado ","Relación Procesos G - GR - C","Tipo Relación","Alcance General","Frecuencia","Riesgos Críticos Globales","Cantidad de Auditores","Horas de Auditoría","Mes Inicio","Mes Termino","Cantidad de Informes que se remitirán al CAIGG, asociados al Trabajo.","Fecha estimada de envío del Informe"]
["ASEG-1","Ejecución de Obras","Institucional (I)","Verificar que durante la ejecución de las obras se de cumplimiento a las exigencias establecidas en el contrato, en el Reglamento y en la normativa vigente.","Iniciativas de Inversión",{"$f":"IFERROR((INDEX(datos!$U$2:$U$56,MATCH(E5,datos!$T$2:$T$56,0))),\"\")","v":"Gobierno, Gestión de Riesgos, Control"},{"$f":"IFERROR((INDEX(datos!$V$2:$V$56,MATCH(E5,datos!$T$2:$T$56,0))),\"\")","v":"Indirecta"},"Se revisarán contratos de obra que se encuentren en ejecución durante la realización de la auditoría y que tengan al menos el 1° Estado de Pago cursado. Se considerará al menos el 10% del universo identificado. La muestra a determinar se seleccionará según requerimientos del Jefe de Servicio al momento de la programación del trabajo.  ","Anual","• Que el terreno entregado no corresponda a lo estipulado en los antecedentes validados anteriormente (topográficos, planos, mecánica de suelos, legales, etc.).\n• Que no se obtenga la totalidad de los permisos necesarios para dar inicio a las obras.\n• Que la instalación de faenas no cumpla con los requerimientos establecidos.\n• Incumplimiento de normas de prevención de riesgos.\n• Cancelación de estados de pagos sobre los avances reales.\n• Errores en los estados de pago, ya sea en el cálculo o en los documentos con los que se deben respaldar.\n• Pérdida, deterioro o desorden en la documentación que respalda el contrato.\n• Incumplimiento de especificaciones técnicas del contrato.\n• Errores administrativos en la modificación del contrato.\n• Modificaciones de contratos sin adecuada justificación técnica.\n• Ejecución del contrato sin las garantías y seguros establecidos según Reglamento o Bases.",2,180,"Marzo","Junio",1,"2022-07-31"]
["ASEG-2","Contratación de Obras y Diseños","Institucional (I)","Verificar que la selección y adjudicación de ofertas para la ejecución de contratos de obras y consultorías cumpla con lo establecido en el respectivo Reglamento y con las normas de probidad y transparencia.","Iniciativas de Inversión",{"$f":"IFERROR((INDEX(datos!$U$2:$U$56,MATCH(E6,datos!$T$2:$T$56,0))),\"\")","v":"Gobierno, Gestión de Riesgos, Control"},{"$f":"IFERROR((INDEX(datos!$V$2:$V$56,MATCH(E6,datos!$T$2:$T$56,0))),\"\")","v":"Indirecta"},"Procesos de contratación de obras y consultorías desarrollados durante el 1° cuatrimestre de 2022. Se considerará al menos el 10% del universo identificado. La muestra a determinar se seleccionará según requerimientos del Jefe de Servicio al momento de la programación del trabajo.","Anual","• Falta de difusión del llamado a licitación en Diario Oficial o falta de antecedentes requeridos en portal Mercado Público.\n• Respuestas poco claras o inconsistentes.\n• Incumplimiento de los plazos establecidos en la calendarización.\n• No se dio solución a los reclamos presentados por los oferentes al proceso de licitación.\n• Adjudicación de propuestas no se realizó de acuerdo a las bases o al respectivo Reglamento.",2,180,"Mayo","Agosto",1,"2022-09-30"]
{"$rows_left_out":195}
{"sheet":"2.- Trabajos de Consultoría","index":5,"n_rows":200,"n_cols":14,"rows_kept":200,"cut":false,"hidden":false,"merged":[[1,0,1,11]]}
[2]
["2.- Trabajos de Consultoría"]
[]
["Codigo trabajo consultoria","Nombre del Trabajo","Objetivo General del Trabajo de  Consultoría","Tipo de Trabajo","Proceso Transversal en el Estado ","Relación Procesos G - GR - C","Tipo Relación","Frecuencia","Cantidad de Auditores","Horas de Auditoria","Mes Inicio","Mes Termino","Cantidad de Informes que se remitirán al CAIGG, asociados al Trabajo.","Fecha estimada de envío del Informe"]
[null,null,null,null,null,{"$f":"IFERROR((INDEX(datos!$U$2:$U$56,MATCH(E5,datos!$T$2:$T$56,0))),\"\")","v":""},{"$f":"IFERROR((INDEX(datos!$V$2:$V$56,MATCH(E5,datos!$T$2:$T$56,0))),\"\")","v":""}]
[null,null,null,null,null,{"$f":"IFERROR((INDEX(datos!$U$2:$U$56,MATCH(E6,datos!$T$2:$T$56,0))),\"\")","v":""},{"$f":"IFERROR((INDEX(datos!$V$2:$V$56,MATCH(E6,datos!$T$2:$T$56,0))),\"\")","v":""}]
{"$rows_left_out":195}
{"sheet":"3.- Trabajos de Seguimiento","index":6,"n_rows":200,"n_cols":16,"rows_kept":200,"cut":false,"hidden":false,"merged":[[1,0,1,13]]}
[3]
["3.- Trabajos de Seguimiento"]
[]
["Codigo Trabajo de Seguimiento","Nombre del Trabajo","Tipo de Trabajo","Objetivo de Auditoría General del Trabajo","Materia de Seguimiento","Proceso Transversal en el Estado ","Relación Procesos G - GR - C","Tipo Relación","Frecuencia","Incluye anexo con Compromisos Pendientes de implementar","Cantidad de Auditores","Horas de Auditoria","Mes Inicio","Mes Termino","Cantidad de Informes que se remitirán al CAIGG, asociados al Trabajo.","Fecha estimada de envío del Informe"]
["SEG-1","Seguimiento Auditoría Compras Públicas","Gubernamental (G)","Realizar un seguimiento de los compromisos originados a partir del Aseguramiento al Proceso de Compras Públicas realizado el año 2021.","Compromisos originados a partir del Aseguramiento al Proceso de Compras Públicas que se encuentren pendientes.","Auditoría Interna",{"$f":"IFERROR((INDEX(datos!$U$2:$U$56,MATCH(F5,datos!$T$2:$T$56,0))),\"\")","v":"Gobierno, Gestión de Riesgos, Control"},{"$f":"IFERROR((INDEX(datos!$V$2:$V$56,MATCH(F5,datos!$T$2:$T$56,0))),\"\")","v":"Directa"},"Anual","Sí",2,50,"Marzo","Marzo",1,"2022-03-31"]
["SEG-2","Seguimiento al Examen del Sistema de Control Interno Financiero y no Financiero (COSO)","Gubernamental (G)","Realizar un seguimiento de los compromisos originados a partir del Exámen del Sistema de Control Interno Financiero y no Financiero realizado el 2021.","Compromisos originados a partir del Examen del Sistema de Control Interno Financiero y no Financiero que se encuentren pendientes.","Auditoría Interna",{"$f":"IFERROR((INDEX(datos!$U$2:$U$56,MATCH(F6,datos!$T$2:$T$56,0))),\"\")","v":"Gobierno, Gestión de Riesgos, Control"},{"$f":"IFERROR((INDEX(datos!$V$2:$V$56,MATCH(F6,datos!$T$2:$T$56,0))),\"\")","v":"Directa"},"Anual","Sí",2,50,"Marzo","Marzo",1,"2022-03-31"]
{"$rows_left_out":195}
{"sheet":"4.- Trabajos Rutinarios","index":7,"n_rows":200,"n_cols":12,"rows_kept":200,"cut":false,"hidden":false,"merged":[[1,0,1,11]]}
[4]
["4.- Trabajos Rutinarios y Obligatorios por Normativa"]
[]
["Codigo Trabajo Rutinario","Nombre del Trabajo","Tipo de Trabajo","Objetivo de Auditoría General del Trabajo","Proceso Transversal en el Estado ","Relación Procesos G - GR - C","Tipo Relación","Frecuencia","Cantidad de Auditores","Horas de Auditoría","Mes Inicio","Mes Termino"]
["RUT-1","Verificación Indicadores de Desempeño Colectivo","Ministerial (M)","Verificar el cumplimiento de las metas del convenio de desempeño colectivo del Servicio.","Auditoría Interna",{"$f":"IFERROR((INDEX(datos!$U$2:$U$56,MATCH(E5,datos!$T$2:$T$56,0))),\"\")","v":"Gobierno, Gestión de Riesgos, Control"},{"$f":"IFERROR((INDEX(datos!$V$2:$V$56,MATCH(E5,datos!$T$2:$T$56,0))),\"\")","v":"Directa"},"Anual",2,100,"Enero","Enero"]
["RUT-2","Seguimiento del Informe de Verificación 2021 y Certificación Anual del Auditor Interno","Gubernamental (G)","Verificar el cumplimiento de las instrucciones sobre austeridad, probidad y eficiencia en el uso de los recursos públicos.","Auditoría Interna",{"$f":"IFERROR((INDEX(datos!$U$2:$U$56,MATCH(E6,datos!$T$2:$T$56,0))),\"\")","v":"Gobierno, Gestión de Riesgos, Control"},{"$f":"IFERROR((INDEX(datos!$V$2:$V$56,MATCH(E6,datos!$T$2:$T$56,0))),\"\")","v":"Directa"},"Anual",2,5,"Marzo","Marzo"]
{"$rows_left_out":195}
{"sheet":"5.- Trabajos Dirección","index":8,"n_rows":200,"n_cols":16,"rows_kept":200,"cut":false,"hidden":false,"merged":[[1,0,1,11]]}
[5]
["5.- Trabajos Solicitados por el Jefe de Servicio"]
[]
["Codigo Trabajo Solicitado","Nombre del Trabajo","Clasificación del trabajo ","Tipo de Trabajo","Objetivo General de Auditoría","Proceso Transversal en el Estado ","Relación Procesos G - GR - C","Tipo Relación","Frecuencia","Riesgos Críticos Globales (en caso que trabajo sea de Aseguramiento","Cantidad de Auditores","Horas de Auditoria","Mes Inicio","Mes Termino","Cantidad de Informes que se remitirán al CAIGG, asociados al Trabajo.","Fecha estimada de envío del Informe"]
[null,null,null,null,null,null,{"$f":"IFERROR((INDEX(datos!$U$2:$U$56,MATCH(F5,datos!$T$2:$T$56,0))),\"\")","v":""},{"$f":"IFERROR((INDEX(datos!$V$2:$V$56,MATCH(F5,datos!$T$2:$T$56,0))),\"\")","v":""}]
[null,null,null,null,null,null,{"$f":"IFERROR((INDEX(datos!$U$2:$U$56,MATCH(F6,datos!$T$2:$T$56,0))),\"\")","v":""},{"$f":"IFERROR((INDEX(datos!$V$2:$V$56,MATCH(F6,datos!$T$2:$T$56,0))),\"\")","v":""}]
{"$rows_left_out":195}
{"sheet":"Calculo de horas disponibles","index":9,"n_rows":24,"n_cols":3,"rows_kept":24,"cut":false,"hidden":false,"merged":[[23,1,23,2],[0,0,0,2],[16,1,16,2],[8,1,8,2],[3,1,3,2]]}
["Cálculo de Horas Disponibles"]
[]
[]
[null,"Calculo de días disponibles"]
[null,"Número de Funcionarios de la Unidad de Auditoría Interna",2]
[null,"Total  de días habiles del año planificado",252]
{"$rows_left_out":19}
{"sheet":"Detalle Capacitaciones","index":10,"n_rows":150,"n_cols":7,"rows_kept":150,"cut":false,"hidden":false,"merged":[[1,1,1,3],[1,4,1,6]]}
[]
[null,"Total de horas estimadas para Capacitaciones año planificado",null,null,{"$f":"SUM(G4:G150)","v":26}]
[null,"Nombre Actividad Capacitación","Proveedor Capacitación (CAIGG-CGR- Otros)","Especificar otro proveedor","Número de participantes","Horas Actividad","Horas totales"]
[null,"Cursos CAIGG","CAIGG",null,2,5,{"$f":"E4*F4","v":10}]
[null,"Cursos coordinados por Auditoría Ministerial","OTROS","Auditoría Ministerial",2,3,{"$f":"E5*F5","v":6}]
[null,"Cursos coordinados por el Servicio","OTROS",null,2,5,10]
{"$rows_left_out":145}
{"sheet":"6.- Resumen de horas estimadas","index":11,"n_rows":13,"n_cols":2,"rows_kept":13,"cut":false,"hidden":false,"merged":[[12,1,12,5],[8,1,8,5],[9,1,9,5],[10,1,10,5],[11,1,11,5],[1,0,1,6],[4,1,4,5],[5,1,5,5],[6,1,6,5],[7,1,7,5]]}
[6]
["6.- Estimación de  Horas Totales Disponibles"]
[]
[]
["Cantidad Horas disponibles año 20XX",3240]
["Total Horas definidas en Trabajos de aseguramiento",1490]
{"$rows_left_out":8}
{"sheet":"formato_resumen","index":12,"n_rows":47,"n_cols":17,"rows_kept":47,"cut":false,"hidden":true,"merged":[[46,6,46,9],[33,1,33,16],[39,1,39,11],[40,1,40,2],[40,3,40,11],[41,1,41,2],[41,3,41,11],[42,1,42,2],[42,3,42,11],[43,1,43,2],[43,3,43,11],[45,6,45,9],[26,1,26,12],[1,1,1,12],[3,2,3,5],[3,7,3,10],[4,2,4,5],[4,7,4,10],[5,2,5,5],[5,7,5,10],[6,2,6,5],[6,7,6,10],[8,1,8,16],[14,1,14,14],[20,1,20,16]]}
[]
[null,"Plan Anual de Auditoría "]
[]
[null,"Ministerio: ",null,null,null,null,"Año planificado"]
[null,"Servicio:",null,null,null,null,"Versión"]
[null,"Servicio dependiente",null,null,null,null,"Fecha de Emisión:"]
{"$rows_left_out":42}
{"sheet":"Plan - COSO","index":13,"n_rows":28,"n_cols":9,"rows_kept":28,"cut":false,"hidden":false,"merged":[[26,6,27,8],[27,1,27,2],[24,1,25,1],[26,1,26,2],[1,1,1,8],[9,1,13,1],[14,1,17,1],[18,1,20,1],[21,1,23,1],[3,1,3,8],[4,1,4,8],[5,1,5,8],[6,1,6,2],[6,3,6,8],[7,1,8,1],[7,3,7,5],[7,6,8,6],[7,7,8,7]]}
[]
[null,"RELACIÓN ENTRE LOS TRABAJOS DE ASEGURAMIENTO Y DE CONSULTORÍA CONTENIDOS EN EL PLAN ANUAL DE AUDITORÍA Y LOS COMPONENTES,  PRINCIPIOS  Y OBJETIVOS DEL MARCO COSO 2013"]
[]
[]
[null,{"$f":" CONCATENATE(\"RELACIÓN ENTRE EL PLAN ANUAL DE AUDITORÍA \", Inicio!E4, \"  Y EL MARCO COSO 2013\")","v":"RELACIÓN ENTRE EL PLAN ANUAL DE AUDITORÍA 2022  Y EL MARCO COSO 2013"}]
[]
{"$rows_left_out":23}
{"sheet":"Instituciones","index":14,"n_rows":295,"n_cols":74,"rows_kept":295,"cut":false,"hidden":true,"merged":[]}
["MINISTERIO","EMPRESAS ESTADO","AGRICULTURA","BIENES NACIONALES","CIENCIA TECNOLOGÍA CONOCIMIENTO E INNOVACIÓN","CULTURAS LAS ARTES Y EL PATRIMONIO CULTURAL","DEFENSA NACIONAL","ECONOMÍA FOMENTO Y TURISMO","EDUCACIÓN","ENERGÍA","HACIENDA","INTERIOR Y SEGURIDAD PÚBLICA","JUSTICIA","MEDIO AMBIENTE","MINERÍA","OBRAS PÚBLICAS","DESARROLLO SOCIAL Y FAMILIA","PRESIDENCIA DE LA REPÚBLICA","RELACIONES EXTERIORES","SALUD","SECRETARÍA GENERAL DE GOBIERNO","SECRETARÍA GENERAL DE LA PRESIDENCIA DE LA REPÚBLICA","MUJER Y LA EQUIDAD DE GÉNERO","TRABAJO Y PREVISIÓN SOCIAL","TRANSPORTES Y TELECOMUNICACIONES","VIVIENDA Y URBANISMO","DEPORTE","DIVISION","AGUAS ANDINAS S.A.","ASTILLEROS Y MAESTRANZAS DE LA ARMADA","BANCO ESTADO DE CHILE","CASA DE MONEDA","COMERCIALIZADORA DE TRIGO","CODELCO","DESARROLLO DE TECNOLOGÍA Y SISTEMAS LIMITADA","CONCESIONARIA DE SERVICIOS SANITARIOS","ABASTECIMIENTO DE ZONAS AISLADAS","CORREOS DE CHILE","FERROCARRILES DEL ESTADO","SERVICIOS SANITARIOS LAGO PEÑUELAS","METRO S.A","EMPRESA NACIONAL DE MINERÍA","EMPRESA NACIONAL DEL CARBÓN S.A","EMPRESA NACIONAL DEL PETRÓLEO","LA NACIÓN S.A.","PORTUARIA ANTOFAGASTA","PORTUARIA ARICA","PORTUARIA AUSTRAL","PORTUARIA CHACABUCO","PORTUARIA COQUIMBO","PORTUARIA IQUIQUE","PORTUARIA PUERTO MONTT","PORTUARIA SAN ANTONIO","PORTUARIA TALCAHUANO-SAN VICENTE","PORTUARIA VALPARAÍSO","ESSAL S.A.","ESSBÍO S.A.","ESVAL S.A.","FÁBRICA Y MAESTRANZAS DEL EJÉRCITO","POLLA CHILENA DE BENEFICENCIA","PUERTO MADERO IMPRESORES","SOCIEDAD AGRÍCOLA SACOR","SOCIEDAD AGRÍCOLA Y SERVICIOS ISLA DE PASCUA LTDA","TELEVISIÓN NACIONAL DE CHILE","ZONA FRANCA DE IQUIQUE S.A","REGION","","","","","","","",""]
["AGRICULTURA","ASTILLEROS Y MAESTRANZAS DE LA ARMADA","CENTRO DE INFORMACIÓN DE RECURSOS NATURALES","SUBSECRETARÍA DE BIENES NACIONALES","AGENCIA NACIONAL DE INVESTIGACIÓN Y DESARROLLO","SUBSECRETARÍA DE LAS CULTURAS Y LAS ARTES","ACADEMIA NACIONAL DE ESTUDIOS POLÍTICOS Y ESTRATÉGICOS","AGENCIA DE LA PROMOCIÓN DE LA INVERSIÓN EXTRANJERA","AGENCIA DE CALIDAD ","COMISIÓN CHILENA DE ENERGÍA NUCLEAR","CONSEJO DE DEFENSA DEL ESTADO","DIRECCIÓN DE PREVISIÓN DE CARABINEROS DE CHILE","CORPORACIÓN DE ASISTENCIA JUDICIAL BÍO-BÍO","SERVICIO DE EVALUACIÓN AMBIENTAL","COMISIÓN CHILENA DEL COBRE","DIRECCIÓN DE AEROPUERTOS","CORPORACIÓN NACIONAL DE DESARROLLO INDÍGENA","DIRECCIÓN ADMINISTRATIVA DE LA PRESIDENCIA","AGENCIA DE COOPERACIÓN INTERNACIONAL PARA EL DESARROLLO","CENTRAL DE ABASTECIMIENTO DEL SISTEMA NACIONAL DE SERVICIOS DE SALUD","CONSEJO NACIONAL DE TELEVISIÓN ","SUBSECRETARÍA GENERAL DE LA PRESIDENCIA DE LA REPÚBLICA","SERVICIO NACIONAL DE LA MUJER Y LA EQUIDAD DE GÉNERO","DIRECCIÓN DEL TRABAJO ","JUNTA DE AERONÁUTICA CIVIL","PARQUE METROPOLITANO DE SANTIAGO","INSTITUTO NACIONAL DE DEPORTES ","AUDITORIA ADMINISTRATIVA",null,"Sociber Ltda.","BancoEstado Corredores de Seguros S.A.",null,null,"Agua de la falda S.A.",null,null,null,null,"Desarrollo Inmobiliario San Bernardo S. A.",null,null,"Cia. Minera Nacional Ltda.",null,"A&C Pipeline Holding (I. Cayman)","Base de Datos del Diario Oficial S.A.",null,null,null,null,null,null,null,null,null,null,null,null,null,"Arcomet S.A.",null,null,null,null,null,null,"ARICA Y PARINACOTA","XV","DE ARICA Y PARINACOTA",null,{"$f":"TRIM($A2)","v":"AGRICULTURA"}]
["BIENES NACIONALES","BANCO ESTADO DE CHILE","COMISIÓN NACIONAL DE RIEGO",null,"SUBSECRETARÍA DE CIENCIA, TECNOLOGÍA, CONOCIMIENTO E INNOVACIÓN","SUBSECRETARÍA DEL PATRIMONIO CULTURAL","CAJA DE PREVISIÓN DE LA DEFENSA NACIONAL","CORPORACIÓN DE FOMENTO DE LA PRODUCCIÓN","COMISIÓN NACIONAL DE ACREDITACIÓN","COMISIÓN NACIONAL DE ENERGÍA","DIRECCIÓN DE COMPRAS Y CONTRATACIÓN PÚBLICA","GOBIERNO REGIONAL DE ANTOFAGASTA","CORPORACIÓN DE ASISTENCIA JUDICIAL REGIÓN METROPOLITANA","SUBSECRETARÍA DEL MEDIO AMBIENTE","SERVICIO NACIONAL DE GEOLOGÍA Y MINERÍA","DIRECCIÓN DE ARQUITECTURA","FONDO DE SOLIDARIDAD E INVERSIÓN SOCIAL",null,"DIRECCIÓN DE FRONTERAS Y LIMITES DEL ESTADO ","CENTRO DE REFERENCIA DE SALUD DE MAIPÚ","SUBSECRETARÍA GENERAL DE GOBIERNO",null,"SUBSECRETARÍA DE LA MUJER Y LA EQUIDAD DE GÉNERO","DIRECCIÓN GENERAL DE CRÉDITO PRENDARIO ","SUBSECRETARÍA DE TELECOMUNICACIONES","SERVIU METROPOLITANO","SUBSECRETARÍA DE DEPORTES","INFRAESTRUCTURA Y REGULACIÓN",null,"Sisdef Ltda.","BancoEstado S.A. Corredores de Bolsa S.A.",null,null,"Asociación Garantizadora de Pensiones",null,null,null,null,"Empresa de Transporte Suburbano de Pasajeros S.A. (Transub S.A.)",null,null,"Cia. Minera Quebrada Blanca S.A.",null,"Biocomsa S.A.","Empresa Periodística La Voz S.A.",null,null,null,null,null,null,null,null,null,null,null,null,null,"Fundac S.A.",null,null,null,null,null,null,"TARAPACÁ","I","DE TARAPACÁ",null,{"$f":"TRIM($A3)","v":"BIENES NACIONALES"}]
["CIENCIA TECNOLOGÍA CONOCIMIENTO E INNOVACIÓN","CASA DE MONEDA","CORPORACIÓN NACIONAL FORESTAL",null,null,"SERVICIO NACIONAL DEL PATRIMONIO CULTURAL","DEFENSA CIVIL DE CHILE","FISCALÍA NACIONAL ECONÓMICA","CONSEJO NACIONAL DE EDUCACIÓN","SUBSECRETARÍA DE ENERGÍA","DIRECCIÓN DE PRESUPUESTOS","GOBIERNO REGIONAL DE ARICA Y PARINACOTA","CORPORACIÓN DE ASISTENCIA JUDICIAL TARAPACÁ Y ANTOFAGASTA","SUPERINTENDENCIA DEL MEDIO AMBIENTE","SUBSECRETARÍA DE MINERÍA","DIRECCIÓN DE CONTABILIDAD Y FINANZAS","INSTITUTO NACIONAL DE LA JUVENTUD",null,"DIRECCIÓN GENERAL DE RELACIONES ECONÓMICAS INTERNACIONALES ","CENTRO DE REFERENCIA DE SALUD DE PEÑALOLÉN CORDILLERA ORIENTE",null,null,null,"INSTITUTO DE PREVISIÓN SOCIAL ","SUBSECRETARÍA DE TRANSPORTES","SERVIU REGIÓN DE TARAPACÁ",null,"TOMA DE RAZON Y REGISTRO",null,"Empresa Nacional de Aeronáutica (ENAER)","BancoEstado Servicios de Cobranza S.A.",null,null,"Biosigma S.A.",null,null,null,null,"Ferrocarril de Arica a La Paz S.A.",null,null,"Cia. Minera Carmen de Andacollo S.A.",null,"Compañía Hidrógeno del BíoBío S.A.","Distribuidora Vía Directa S. A.",null,null,null,null,null,null,null,null,null,null,null,null,null,"S2T S.A.",null,null,null,null,null,null,"ANTOFAGASTA","II","DE ANTOFAGASTA",null,"CIENCIA TECNOLOGÍA CONOCIMIENTO E INNOVACIÓN"]
["CULTURAS LAS ARTES Y EL PATRIMONIO CULTURAL","CENTRO DE INVESTIGACIÓN  MINERA Y METALÚRGICA ","FUNDACIÓN DE COMUNICACIÓN, CAPACITACIÓN Y CULTURA DEL AGRO",null,null,null,"DIRECCIÓN GENERAL DE AERONÁUTICA CIVIL","INSTITUTO NACIONAL DE ESTADÍSTICAS","JUNTA NACIONAL DE AUXILIO ESCOLAR Y BECAS","SUPERINTENDENCIA DE ELECTRICIDAD Y COMBUSTIBLES","DIRECCIÓN NACIONAL DEL SERVICIO CIVIL","GOBIERNO REGIONAL DE ATACAMA","CORPORACIÓN DE ASISTENCIA JUDICIAL VALPARAÍSO",null,null,"DIRECCIÓN DE OBRAS HIDRÁULICAS","SERVICIO NACIONAL DE LA DISCAPACIDAD",null,"INSTITUTO ANTÁRTICO CHILENO ","FONDO NACIONAL DE SALUD",null,null,null,"INSTITUTO DE SEGURIDAD LABORAL ",null,"SERVIU REGIÓN DE ANTOFAGASTA",null,"AUDITORÍAS ESPECIALES",null,null,"BancoEstado Microempresas S.A., Asesorías Financieras",null,null,"Centro de Especialidades Médicas Río Blanco Ltda.",null,null,null,null,"Ferrocarriles Suburbanos de Concepción S.A.",null,null,null,null,"Compañía Latinoamericana Petrolera S.A.",null,null,null,null,null,null,null,null,null,null,null,null,null,null,null,null,null,null,null,null,null,"ATACAMA","III","DE ATACAMA",null,"CULTURAS LAS ARTES Y EL PATRIMONIO CULTURAL"]
["DEFENSA NACIONAL","COMERCIALIZADORA DE TRIGO","FUNDACIÓN PARA LA INNOVACIÓN AGRARIA",null,null,null,"DIRECCIÓN GENERAL DE MOVILIZACIÓN NACIONAL","INSTITUTO NACIONAL DE PROPIEDAD INDUSTRIAL","JUNTA NACIONAL DE JARDINES INFANTILES",null,"SERVICIO DE IMPUESTOS INTERNOS","GOBIERNO REGIONAL DE AYSÉN","DEFENSORÍA PENAL PÚBLICA",null,null,"DIRECCIÓN DE OBRAS PORTUARIAS","SERVICIO NACIONAL DEL ADULTO MAYOR",null,"SUBSECRETARÍA DE RELACIONES EXTERIORES","INSTITUTO DE SALUD PÚBLICA DE CHILE",null,null,null,"SERVICIO NACIONAL DE CAPACITACIÓN Y EMPLEO ",null,"SERVIU REGIÓN DE ATACAMA",null,"CGR REGIONAL",null,null,"BancoEstado S.A. Administradora General de Fondos",null,null,"Chile Copper Limited",null,null,null,null,"Infraestructura y Tráfico Ferroviario S.A.",null,null,null,null,"Empresa Nacional de Geotermia S.A.",null,null,null,null,null,null,null,null,null,null,null,null,null,null,null,null,null,null,null,null,null,"COQUIMBO","IV","DE COQUIMBO",null,"DEFENSA NACIONAL"]
{"$rows_left_out":290}
{"sheet":"datos","index":15,"n_rows":404,"n_cols":22,"rows_kept":404,"cut":false,"hidden":true,"merged":[]}
["Validacion","Tipo","Meses","año","version","Frecuencia","tipo",null,"Servicio","Acronimo","Proveedor Capacitación ",null,null,null,null,null,"Numero informes",null,null,"PROC_TRANSV","NAT_AUD","RELACION_NAT"]
[null,"Gubernamental (G)","Enero",2020,"01","Semanal","Consultoria",null,"CENTRO DE INFORMACIÓN DE RECURSOS NATURALES","CIREN","CAIGG",null,"Proveedor Capacitación (CAIGG-CGR- Otros)",null,"SI",null,1,null,"Auditoría","Subsidios a privados de fomento","Gobierno, Gestión de Riesgos, Control","Indirecta"]
[null,"Ministerial (M)","Febrero",2021,"02","Quincenal","Aseguramiento",null,"COMISIÓN NACIONAL DE RIEGO","CNR","CGR","Institucional",null,null,"NO",null,2,null,"Consultoría","Subsidios a privados social","Gobierno, Gestión de Riesgos, Control","Indirecta"]
[null,"Institucional (I)","Marzo",2022,"03","Mensual","Seguimiento",null,"CORPORACIÓN NACIONAL FORESTAL","CONAF","OTROS",null,null,null,null,null,3,null,"Seguimiento","Subsidios a privados asistencial","Gobierno, Gestión de Riesgos, Control","Indirecta"]
[null,null,"Abril",null,"04","Trimestral","Otro",null,"FUNDACIÓN DE COMUNICACIÓN, CAPACITACIÓN Y CULTURA DEL AGRO","FUCOA",null,null,null,null,null,null,4,null,"Rutinaria","Transferencias a/de otras entidades públicas","Gobierno, Gestión de Riesgos, Control","Indirecta"]
[null,null,"Mayo",null,"05","Semestral",null,null,"FUNDACIÓN PARA LA INNOVACIÓN AGRARIA","FIA",null,null,null,null,null,null,5,null,"Dirección","Servicios de atención al ciudadano – contraprestación","Gobierno, Gestión de Riesgos, Control","Indirecta"]
{"$rows_left_out":398}